Target
Genome polyprotein
Ligand
BDBM204526
Substrate
Meas. Tech.
Inhbition Assay
IC50
3±n/a nM
Citation
 He, SDai, XPalani, ANargund, RLai, ZZorn, NXiao, DDang, QMcComas, CCLi, PPeng, XSoll, R Tetracyclic heterocycle compounds and methods of use thereof for the treatment of hepatitis C US Patent  US9242998 Publication Date 1/26/2016 
Target
Name:
Genome polyprotein
Synonyms:
Dipeptidyl peptidase 4 (DPP4) NS3 NS5B NS3-4A Protease NS3/4A protease POLG_HCV77 | RNA polymerase (NS5B)
Type:
Protease Domain
Mol. Mass.:
327221.49
Organism:
Hepatitis C virus (HCV genotype 1a, isolate H)
Description:
P27958
Residue:
3011
  
Inhibitor
Name:
BDBM204526
Synonyms:
US9242998, 4
Type:
Small organic molecule
Emp. Form.:
C31H23F2N5O5S
Mol. Mass.:
615.607
SMILES:
CNC(=O)c1c(oc2cc(N(C)S(C)(=O)=O)c(cc12)-c1ccc2OCn3c(cc4c(F)cccc34)-c2n1)-c1ccc(F)nc1
: