Target
E3 ubiquitin-protein ligase XIAP [241-356]
Ligand
BDBM205408
Substrate
Meas. Tech.
DELFIA Assay
Temperature
298.15±n/a K
IC50
231±n/a nM
Comments
extracted
Citation
 Reiser, U Bis-amido pyridines US Patent  US9249151 Publication Date 2/2/2016 
Target
Name:
E3 ubiquitin-protein ligase XIAP [241-356]
Synonyms:
API3 BIRC4 E3 ubiquitin-protein ligase XIAP BIR-3 IAP3 X-linked inhibitor of apoptosis protein BIR3 domain (XIAP BIR-3) XIAP-BIR3 baculovirus IAP repeat 3 (BIR3) domain of XIAP
Type:
Protein Binding Domain
Mol. Mass.:
13276.62
Organism:
Homo sapiens (Human)
Description:
BIR3 of XIAP: RESIDUES 241-356.
Residue:
116
  
Inhibitor
Name:
BDBM205408
Synonyms:
US9249151, 54
Type:
Small organic molecule
Emp. Form.:
C24H20Cl2N6O2
Mol. Mass.:
495.361
SMILES:
CNC(C)C(=O)Nc1cc(cc(NC(=O)c2ccc(Cl)cn2)n1)-c1c(Cl)cnc2ccccc12
: