Target
Ileal sodium/bile acid cotransporter
Ligand
BDBM77086
Substrate
Meas. Tech.
Pharmaceutical Effect Mean Inhibitory Effect
IC50
0.130±n/a nM
Citation
 Gillberg, PGraffner, HStarke, I IBAT inhibitors for the treatment of liver diseases US Patent  US10093697 Publication Date 10/9/2018 
Target
Name:
Ileal sodium/bile acid cotransporter
Synonyms:
ASBT IBAT Ileal Na(+)/bile acid cotransporter Ileal bile acid transporter/bile acid cotransporter NTCP2 SLC10A2
Type:
Enzyme
Mol. Mass.:
37714.89
Organism:
Homo sapiens (Human)
Description:
SLC10A2
Residue:
348
  
Inhibitor
Name:
BDBM77086
Synonyms:
US10093697, 13. US9694018, 13
Type:
Small organic molecule
Emp. Form.:
C38H50N4O8S2
Mol. Mass.:
754.956
SMILES:
CCCCC1(CCCC)CN(c2ccccc2)c2cc(SC)c(OCC(=O)N[C@@H](C(=O)N[C@@H](C(C)C)C(O)=O)c3ccc(O)cc3)cc2S(=O)(=O)N1
: