Target
Stromelysin-1
Ligand
BDBM50181008
Substrate
Meas. Tech.
Inhibition Assay
IC50
10±n/a nM
Citation
 Clary, LPascal, J 4-alkoxy-N-(2-hydroxycarbamoyl-2-piperidinyl-ethyl)-benzamide compounds as selective TACE-inhibitors for the treatment of inflammatory diseases US Patent  US9266848 Publication Date 2/23/2016 
Target
Name:
Stromelysin-1
Synonyms:
MMP-3 MMP3_HUMAN Matrix metalloproteinase 3 Matrix metalloproteinase-3 (MMP-3) SL-1 Stromelysin 1 | Transin-1
Type:
Enzyme
Mol. Mass.:
53973.13
Organism:
Homo sapiens (Human)
Description:
P08254
Residue:
477
  
Inhibitor
Name:
BDBM50181008
Synonyms:
(S)-N-hydroxy-4-(4-(4-hydroxybut-2-ynyloxy)phenylsulfonyl)-2,2-dimethylthiomorpholine-3-carboxamide TMI-05 US9365529, Apratastat
Type:
Small organic molecule
Emp. Form.:
C17H22N2O6S2
Mol. Mass.:
414.496
SMILES:
CC1(C)SCCN([C@H]1C(=O)NO)S(=O)(=O)c1ccc(OCC#CCO)cc1
: