Target
Disintegrin and metalloproteinase domain-containing protein 17
Ligand
BDBM50181008
Substrate
Meas. Tech.
TACE Enzyme Assay
pH
7.4±n/a
Temperature
310.15±n/a K
IC50
5±n/a nM
Comments
extracted
Citation
 Clary, LPascal, J 4-alkoxy-N-(2-hydroxycarbamoyl-2-piperidinyl-ethyl)-benzamide compounds as selective TACE-inhibitors for the treatment of inflammatory diseases US Patent  US9266848 Publication Date 2/23/2016 
Target
Name:
Disintegrin and metalloproteinase domain-containing protein 17
Synonyms:
ADA17_HUMAN CSVP Disintegrin and metalloproteinase domain-containing protein 17 (ADAM17) TNF-alpha convertase TNF-alpha-converting enzyme (TACE) Tumor necrosis factor-α converting enzyme (TACE)
Type:
Enzyme
Mol. Mass.:
93007.89
Organism:
Homo sapiens (Human)
Description:
Residue:
824
  
Inhibitor
Name:
BDBM50181008
Synonyms:
(S)-N-hydroxy-4-(4-(4-hydroxybut-2-ynyloxy)phenylsulfonyl)-2,2-dimethylthiomorpholine-3-carboxamide TMI-05 US9365529, Apratastat
Type:
Small organic molecule
Emp. Form.:
C17H22N2O6S2
Mol. Mass.:
414.496
SMILES:
CC1(C)SCCN([C@H]1C(=O)NO)S(=O)(=O)c1ccc(OCC#CCO)cc1
: