Target
Uracil-DNA glycosylase
Ligand
BDBM208033
Substrate
Meas. Tech.
Viral Plaque Reduction Assay
Temperature
310.15±n/a K
IC50
50000±n/a nM
Comments
extracted
Citation
 Ricciardi, RPNuth, M Potent poxvirus inhibitor US Patent  US9233921 Publication Date 1/12/2016 
Target
Name:
Uracil-DNA glycosylase
Synonyms:
OPG116 UNG_VACCC | vaccinia virus D4/A20
Type:
Mol. Mass.:
25083.53
Organism:
Vaccinia virus (strain Copenhagen) (VACV)
Description:
P20536
Residue:
218
  
Inhibitor
Name:
BDBM208033
Synonyms:
3-((4-chlorophenyl)thio)-4,7-dimethyl-1H-indole-2-carboxylic acid | US9233921, 1j
Type:
Small organic molecule
Emp. Form.:
C17H14ClNO2S
Mol. Mass.:
331.817
SMILES:
Cc1ccc(C)c2c(Sc3ccc(Cl)cc3)c([nH]c12)C(O)=O
: