Target
Genome polyprotein
Ligand
BDBM208219
Substrate
Meas. Tech.
ELISA-Based Assay
IC50
1±n/a nM
Citation
 McComas, CCLiverton, NJHabermann, JKoch, UNarjes, FLi, PPeng, XSoll, RWu, HPalani, AHe, SDai, XLiu, HLai, ZLondon, CXiao, DZorn, NNargund, R Tetracyclic heterocycle compounds and methods of use thereof for the treatment of viral diseases US Patent  US9265773 Publication Date 2/23/2016 
Target
Name:
Genome polyprotein
Synonyms:
HCV Polymerase (S282T) NS3/4A Protein POLG_HCVJA
Type:
Protein
Mol. Mass.:
327076.78
Organism:
Hepatitis C Virus (Virus)
Description:
P26662
Residue:
3010
  
Inhibitor
Name:
BDBM208219
Synonyms:
US9265773, 164
Type:
Small organic molecule
Emp. Form.:
C32H20F2N6O4
Mol. Mass.:
590.5358
SMILES:
CNC(=O)c1c(oc2cc(c(cc12)-c1ccc2OCn3c(cc4c(F)cccc34)-c2n1)-n1cn[nH]c1=O)-c1ccc(F)cc1
: