Target
Lysine-specific histone demethylase 1A
Ligand
BDBM289872
Substrate
Meas. Tech.
In Vitro Enzyme Inhibition Assay
Temperature
298.15±n/a K
IC50
<100±n/a nM
Comments
extracted
Citation
 Chen, YKKanouni, TKaldor, SWStafford, JAVeal, JM Inhibitors of lysine specific demethylase-1 US Patent  US9573930 Publication Date 2/21/2017 
Target
Name:
Lysine-specific histone demethylase 1A
Synonyms:
AOF2 Flavin-containing amine oxidase domain-containing protein 2 KDM1A KIAA0601 Lysine-specific demethylase 1 (LSD1) Lysine-specific histone demethylase 1 (LSD1)
Type:
Enzyme
Mol. Mass.:
92901.01
Organism:
Homo sapiens (Human)
Description:
O60341
Residue:
852
  
Inhibitor
Name:
BDBM289872
Synonyms:
US9573930, Example 15 | [2-(4-amino-piperidin-1-yl)-4-(4-cyano-3-fluoro-phenyl)-5-(4-methoxy-phenyl)-6-oxo-6H-pyrimidin-1-yl]-acetic acid
Type:
Small organic molecule
Emp. Form.:
C24H24FN6O4
Mol. Mass.:
479.483
SMILES:
COc1ccc(cc1)-c1c(nc(N2CCC(N)CC2)n(CC(O)=O)c1=O)-c1ccc([N+]#N)c(F)c1
: