Target
Lysine-specific histone demethylase 1A
Ligand
BDBM283228
Substrate
Meas. Tech.
In Vitro Enzyme Inhibition Assay
Temperature
298.15±n/a K
IC50
<100±n/a nM
Comments
extracted
Citation
 Chen, YKKanouni, TKaldor, SWStafford, JAVeal, JM Inhibitors of lysine specific demethylase-1 US Patent  US9573930 Publication Date 2/21/2017 
Target
Name:
Lysine-specific histone demethylase 1A
Synonyms:
AOF2 Flavin-containing amine oxidase domain-containing protein 2 KDM1A KIAA0601 Lysine-specific demethylase 1 (LSD1) Lysine-specific histone demethylase 1 (LSD1)
Type:
Enzyme
Mol. Mass.:
92901.01
Organism:
Homo sapiens (Human)
Description:
O60341
Residue:
852
  
Inhibitor
Name:
BDBM283228
Synonyms:
4-[2-(4-amino-piperidin-1-yl)-5- benzofuran-5-yl-1-methyl-6-oxo- 1,6-dihydro-pyrimidin-4-yl]-2- fluoro-benzonitrile US10207999, Example 18 US10548896, Example 18 US10960005, Example 18 US9573930, Example 18 US9776974, Example 18
Type:
Small organic molecule
Emp. Form.:
C25H22FN5O2
Mol. Mass.:
443.4729
SMILES:
Cn1c(nc(-c2ccc(C#N)c(F)c2)c(-c2ccc3occc3c2)c1=O)N1CCC(N)CC1
: