Target
Lysine-specific histone demethylase 1A
Ligand
BDBM283266
Substrate
Meas. Tech.
In Vitro Enzyme Inhibition Assay
Temperature
298.15±n/a K
IC50
<100±n/a nM
Comments
extracted
Citation
 Chen, YKKanouni, TKaldor, SWStafford, JAVeal, JM Inhibitors of lysine specific demethylase-1 US Patent  US9573930 Publication Date 2/21/2017 
Target
Name:
Lysine-specific histone demethylase 1A
Synonyms:
AOF2 Flavin-containing amine oxidase domain-containing protein 2 KDM1A KIAA0601 Lysine-specific demethylase 1 (LSD1) Lysine-specific histone demethylase 1 (LSD1)
Type:
Enzyme
Mol. Mass.:
92901.01
Organism:
Homo sapiens (Human)
Description:
O60341
Residue:
852
  
Inhibitor
Name:
BDBM283266
Synonyms:
4-[2-(4-amino-piperidin-1-yl)- 2'-dimethylamino-1-methyl-6-oxo- 1,6-dihydro-[5,5']bipyrimidinyl-4- yl]-2-fluoro-benzonitrile US10207999, Example 49 US10548896, Example 49 US10960005, Example 49 US9573930, Example 49 US9776974, Example 49
Type:
Small organic molecule
Emp. Form.:
C23H25FN8O
Mol. Mass.:
448.496
SMILES:
CN(C)c1ncc(cn1)-c1c(nc(N2CCC(N)CC2)n(C)c1=O)-c1ccc(C#N)c(F)c1
: