Target
Dihydrofolate reductase
Ligand
BDBM210930
Substrate
Meas. Tech.
DHFR Inhibition Assay
IC50
91± 8 nM
Citation
 Reeve, SMScocchera, EWG-Dayanadan, NKeshipeddy, SKrucinska, JHajian, BFerreira, JNailor, MAeschlimann, JWright, DLAnderson, AC MRSA Isolates from United States Hospitals Carry dfrG and dfrK Resistance Genes and Succumb to Propargyl-Linked Antifolates. Cell Chem Biol 23:1458-1467 (2016)  
Target
Name:
Dihydrofolate reductase
Synonyms:
Dihydrofolate reductase (DfrK)
Type:
Protein
Mol. Mass.:
19251.04
Organism:
Staphylococcus aureus
Description:
C7C2U7
Residue:
163
  
Inhibitor
Name:
BDBM210930
Synonyms:
UCP1173
Type:
Small organic molecule
Emp. Form.:
C24H24N4O3
Mol. Mass.:
416.4724
SMILES:
CCc1nc(N)nc(N)c1C#C[C@H](C)c1cc(OC)cc(c1)-c1ccc(cc1)C(O)=O
: