Target
Carbonic anhydrase 2
Ligand
BDBM210935
Substrate
Meas. Tech.
CA Inhibition Assay
Ki
0.8±0.0 nM
Citation
 Bhatt, AMahon, BPCruzeiro, VWCornelio, BLaronze-Cochard, MCeruso, MSapi, JRance, GAKhlobystov, ANFontana, ARoitberg, ASupuran, CTMcKenna, R Structure-Activity Relationships of Benzenesulfonamide-Based Inhibitors towards Carbonic Anhydrase Isoform Specificity. Chembiochem 18:213-222 (2017)  
Target
Name:
Carbonic anhydrase 2
Synonyms:
CA-II CAC Carbonate dehydratase II Carbonic anhydrase 2 (CA-II) Carbonic anhydrase C Carbonic anhydrase II (CA-II) Carbonic anhydrase II (hCA II) | Carbonic anhydrase isoenzyme II (hCA II)
Type:
Enzyme
Mol. Mass.:
29250.71
Organism:
Homo sapiens (Human)
Description:
P00918
Residue:
260
  
Inhibitor
Name:
BDBM210935
Synonyms:
4-(phenyl)-bezenesulfonamide (4a)
Type:
Small organic molecule
Emp. Form.:
C12H11NO2S
Mol. Mass.:
233.286
SMILES:
NS(=O)(=O)c1ccc(cc1)-c1ccccc1
: