Target
Neutrophil elastase
Ligand
BDBM211897
Substrate
BDBM211682
Meas. Tech.
Neutrophil Elastase Assay
pH
7.5±n/a
Temperature
298.15±n/a K
IC50
<1±n/a nM
Comments
extracted
Citation
 Gnamm, COost, TPeters, SHoesch, HRies, UJ Substituted bicyclic dihydropyrimidinones and their use as inhibitors of neutrophil elastase activity US Patent  US9290459 Publication Date 3/22/2016 
Target
Name:
Neutrophil elastase
Synonyms:
Bone marrow serine protease Coagulation factor X ELANE Elastase HLE Leukocyte elastase Medullasin Neutrophil elastase (HNE) PMN elastase Trypsin
Type:
Enzyme
Mol. Mass.:
28532.38
Organism:
Homo sapiens (Human)
Description:
P08246
Residue:
267
  
Inhibitor
Name:
BDBM211897
Synonyms:
US9290459, 47.12 | US9670166, 47.12
Type:
Small organic molecule
Emp. Form.:
C27H23F3N4O6S
Mol. Mass.:
588.555
SMILES:
CS(=O)(=O)c1cc(ccc1[C@H]1N(C(=O)NC2CCOC2)C(=O)N(C2=C1C(=O)CC2)c1cccc(c1)C(F)(F)F)C#N
:
Substrate
Name:
BDBM211682
Synonyms:
US9290457, MeOSuc-AAPV-AMC
Type:
Substrate
Emp. Form.:
C31H41N5O9
Mol. Mass.:
627.6853
SMILES:
COC(=O)CCC(=O)NC(C)C(=O)NC(C)C(=O)N1CCCC1C(=O)NC(C(C)C)C(=O)Nc1ccc2c(C)cc(=O)oc2c1
: