Target
Arachidonate 5-lipoxygenase-activating protein
Ligand
BDBM164971
Substrate
Meas. Tech.
FLAP Binding Assay
Ki
16±n/a nM
Citation
 Chai, WDeckhut, CDvorak, CAEccles, WEdwards, JPGoldberg, SDKrawczuk, PJLebsack, ADLiu, JTanis, VMTarantino, KT 1,2,5-Substituted benzimidazoles as flap modulators US Patent  US9682971 Publication Date 6/20/2017 
Target
Name:
Arachidonate 5-lipoxygenase-activating protein
Synonyms:
5-lipoxygenase activating protein 5-lipoxygenase/FLAP ALOX5AP MK-886-binding protein
Type:
Enzyme
Mol. Mass.:
18159.90
Organism:
Homo sapiens (Human)
Description:
P20292
Residue:
161
  
Inhibitor
Name:
BDBM164971
Synonyms:
US9067917, 4 | US9682971, 4
Type:
Small organic molecule
Emp. Form.:
C31H28BrN3O3
Mol. Mass.:
570.476
SMILES:
OC(=O)[C@H]1CCCCC1c1nc2cc(OCc3ccc4ccccc4n3)ccc2n1Cc1cccc(Br)c1
: