Target
Arachidonate 5-lipoxygenase-activating protein
Ligand
BDBM164982
Substrate
Meas. Tech.
FLAP Binding Assay
Ki
7.00±n/a nM
Citation
 Chai, WDeckhut, CDvorak, CAEccles, WEdwards, JPGoldberg, SDKrawczuk, PJLebsack, ADLiu, JTanis, VMTarantino, KT 1,2,5-Substituted benzimidazoles as flap modulators US Patent  US9682971 Publication Date 6/20/2017 
Target
Name:
Arachidonate 5-lipoxygenase-activating protein
Synonyms:
5-lipoxygenase activating protein 5-lipoxygenase/FLAP ALOX5AP MK-886-binding protein
Type:
Enzyme
Mol. Mass.:
18159.90
Organism:
Homo sapiens (Human)
Description:
P20292
Residue:
161
  
Inhibitor
Name:
BDBM164982
Synonyms:
US9067917, 15 | US9682971, 15
Type:
Small organic molecule
Emp. Form.:
C31H27BrFN3O3
Mol. Mass.:
588.467
SMILES:
OC(=O)[C@H]1CCCC[C@H]1c1nc2cc(OCc3ccc4ccccc4n3)ccc2n1Cc1ccc(Br)cc1F
: