Target
Arachidonate 5-lipoxygenase-activating protein
Ligand
BDBM164998
Substrate
Meas. Tech.
FLAP Binding Assay
Ki
20±n/a nM
Citation
 Chai, WDeckhut, CDvorak, CAEccles, WEdwards, JPGoldberg, SDKrawczuk, PJLebsack, ADLiu, JTanis, VMTarantino, KT 1,2,5-Substituted benzimidazoles as flap modulators US Patent  US9682971 Publication Date 6/20/2017 
Target
Name:
Arachidonate 5-lipoxygenase-activating protein
Synonyms:
5-lipoxygenase activating protein 5-lipoxygenase/FLAP ALOX5AP MK-886-binding protein
Type:
Enzyme
Mol. Mass.:
18159.90
Organism:
Homo sapiens (Human)
Description:
P20292
Residue:
161
  
Inhibitor
Name:
BDBM164998
Synonyms:
US9067917, 31 US9682971, 32
Type:
Small organic molecule
Emp. Form.:
C30H26BrN3O3
Mol. Mass.:
556.45
SMILES:
CC1(C)[C@H](C1c1nc2cc(OCc3ccc4ccccc4n3)ccc2n1Cc1ccc(Br)cc1)C(O)=O
: