Target
Arachidonate 5-lipoxygenase-activating protein
Ligand
BDBM165005
Substrate
Meas. Tech.
FLAP Binding Assay
Ki
5.80±n/a nM
Citation
 Chai, WDeckhut, CDvorak, CAEccles, WEdwards, JPGoldberg, SDKrawczuk, PJLebsack, ADLiu, JTanis, VMTarantino, KT 1,2,5-Substituted benzimidazoles as flap modulators US Patent  US9682971 Publication Date 6/20/2017 
Target
Name:
Arachidonate 5-lipoxygenase-activating protein
Synonyms:
5-lipoxygenase activating protein 5-lipoxygenase/FLAP ALOX5AP MK-886-binding protein
Type:
Enzyme
Mol. Mass.:
18159.90
Organism:
Homo sapiens (Human)
Description:
P20292
Residue:
161
  
Inhibitor
Name:
BDBM165005
Synonyms:
US9067917, 38 | US9682971, 38
Type:
Small organic molecule
Emp. Form.:
C32H31N3O3
Mol. Mass.:
505.6068
SMILES:
Cc1ccccc1Cn1c(nc2cc(OCc3ccc4ccccc4n3)ccc12)[C@@H]1CCCC[C@@H]1C(O)=O
: