Target
Arachidonate 5-lipoxygenase-activating protein
Ligand
BDBM165061
Substrate
Meas. Tech.
FLAP Binding Assay
Ki
20±n/a nM
Citation
 Chai, WDeckhut, CDvorak, CAEccles, WEdwards, JPGoldberg, SDKrawczuk, PJLebsack, ADLiu, JTanis, VMTarantino, KT 1,2,5-Substituted benzimidazoles as flap modulators US Patent  US9682971 Publication Date 6/20/2017 
Target
Name:
Arachidonate 5-lipoxygenase-activating protein
Synonyms:
5-lipoxygenase activating protein 5-lipoxygenase/FLAP ALOX5AP MK-886-binding protein
Type:
Enzyme
Mol. Mass.:
18159.90
Organism:
Homo sapiens (Human)
Description:
P20292
Residue:
161
  
Inhibitor
Name:
BDBM165061
Synonyms:
US9067917, 96 | US9682971, 96
Type:
Small organic molecule
Emp. Form.:
C37H31F2N3O3
Mol. Mass.:
603.6571
SMILES:
OC(=O)C1(Cc2nc3cc(OCc4ccc5ccccc5n4)ccc3n2Cc2cccc(c2)-c2ccc(F)c(F)c2)CCCC1
: