Target
Arachidonate 5-lipoxygenase-activating protein
Ligand
BDBM165062
Substrate
Meas. Tech.
FLAP Binding Assay
Ki
5.10±n/a nM
Citation
 Chai, WDeckhut, CDvorak, CAEccles, WEdwards, JPGoldberg, SDKrawczuk, PJLebsack, ADLiu, JTanis, VMTarantino, KT 1,2,5-Substituted benzimidazoles as flap modulators US Patent  US9682971 Publication Date 6/20/2017 
Target
Name:
Arachidonate 5-lipoxygenase-activating protein
Synonyms:
5-lipoxygenase activating protein 5-lipoxygenase/FLAP ALOX5AP MK-886-binding protein
Type:
Enzyme
Mol. Mass.:
18159.90
Organism:
Homo sapiens (Human)
Description:
P20292
Residue:
161
  
Inhibitor
Name:
BDBM165062
Synonyms:
US9067917, 97 | US9682971, 97
Type:
Small organic molecule
Emp. Form.:
C38H36N4O5S
Mol. Mass.:
660.781
SMILES:
CS(=O)(=O)Nc1ccc(cc1)-c1cccc(Cn2c(CC3(CCCC3)C(O)=O)nc3cc(OCc4ccc5ccccc5n4)ccc23)c1
: