Target
Arachidonate 5-lipoxygenase-activating protein
Ligand
BDBM165065
Substrate
Meas. Tech.
FLAP Binding Assay
Ki
15±n/a nM
Citation
 Chai, WDeckhut, CDvorak, CAEccles, WEdwards, JPGoldberg, SDKrawczuk, PJLebsack, ADLiu, JTanis, VMTarantino, KT 1,2,5-Substituted benzimidazoles as flap modulators US Patent  US9682971 Publication Date 6/20/2017 
Target
Name:
Arachidonate 5-lipoxygenase-activating protein
Synonyms:
5-lipoxygenase activating protein 5-lipoxygenase/FLAP ALOX5AP MK-886-binding protein
Type:
Enzyme
Mol. Mass.:
18159.90
Organism:
Homo sapiens (Human)
Description:
P20292
Residue:
161
  
Inhibitor
Name:
BDBM165065
Synonyms:
US9067917, 100 | US9682971, 100
Type:
Small organic molecule
Emp. Form.:
C35H31N3O4
Mol. Mass.:
557.6383
SMILES:
OC(=O)C1(Cc2nc3cc(OCc4ccc5ccccc5n4)ccc3n2Cc2cccc(c2)-c2ccoc2)CCCC1
: