Target
Arachidonate 5-lipoxygenase-activating protein
Ligand
BDBM165107
Substrate
Meas. Tech.
FLAP Binding Assay
Ki
12±n/a nM
Citation
 Chai, WDeckhut, CDvorak, CAEccles, WEdwards, JPGoldberg, SDKrawczuk, PJLebsack, ADLiu, JTanis, VMTarantino, KT 1,2,5-Substituted benzimidazoles as flap modulators US Patent  US9682971 Publication Date 6/20/2017 
Target
Name:
Arachidonate 5-lipoxygenase-activating protein
Synonyms:
5-lipoxygenase activating protein 5-lipoxygenase/FLAP ALOX5AP MK-886-binding protein
Type:
Enzyme
Mol. Mass.:
18159.90
Organism:
Homo sapiens (Human)
Description:
P20292
Residue:
161
  
Inhibitor
Name:
BDBM165107
Synonyms:
US9067917, 142 | US9682971, 142
Type:
Small organic molecule
Emp. Form.:
C34H31N5O3
Mol. Mass.:
557.6416
SMILES:
OC(=O)C1(Cc2nc3cc(OCc4ccc5ccccc5n4)ccc3n2Cc2cccc(c2)-c2ccn[nH]2)CCCC1
: