Target
Arachidonate 5-lipoxygenase-activating protein
Ligand
BDBM165130
Substrate
Meas. Tech.
FLAP Binding Assay
Ki
16±n/a nM
Citation
 Chai, WDeckhut, CDvorak, CAEccles, WEdwards, JPGoldberg, SDKrawczuk, PJLebsack, ADLiu, JTanis, VMTarantino, KT 1,2,5-Substituted benzimidazoles as flap modulators US Patent  US9682971 Publication Date 6/20/2017 
Target
Name:
Arachidonate 5-lipoxygenase-activating protein
Synonyms:
5-lipoxygenase activating protein 5-lipoxygenase/FLAP ALOX5AP MK-886-binding protein
Type:
Enzyme
Mol. Mass.:
18159.90
Organism:
Homo sapiens (Human)
Description:
P20292
Residue:
161
  
Inhibitor
Name:
BDBM165130
Synonyms:
US9067917, 165 | US9682971, 165
Type:
Small organic molecule
Emp. Form.:
C35H32N4O5S
Mol. Mass.:
620.717
SMILES:
CC(C)(Cc1nc2cc(OCc3ccc4ccccc4n3)ccc2n1Cc1cccc(c1)-c1ccc(cc1)S(N)(=O)=O)C(O)=O
: