Target
Arachidonate 5-lipoxygenase-activating protein
Ligand
BDBM165133
Substrate
Meas. Tech.
FLAP Binding Assay
Ki
5.60±n/a nM
Citation
 Chai, WDeckhut, CDvorak, CAEccles, WEdwards, JPGoldberg, SDKrawczuk, PJLebsack, ADLiu, JTanis, VMTarantino, KT 1,2,5-Substituted benzimidazoles as flap modulators US Patent  US9682971 Publication Date 6/20/2017 
Target
Name:
Arachidonate 5-lipoxygenase-activating protein
Synonyms:
5-lipoxygenase activating protein 5-lipoxygenase/FLAP ALOX5AP MK-886-binding protein
Type:
Enzyme
Mol. Mass.:
18159.90
Organism:
Homo sapiens (Human)
Description:
P20292
Residue:
161
  
Inhibitor
Name:
BDBM165133
Synonyms:
US9067917, 168 | US9682971, 168
Type:
Small organic molecule
Emp. Form.:
C36H34N4O5S
Mol. Mass.:
634.744
SMILES:
CC(C)(Cc1nc2cc(OCc3ccc4ccccc4n3)ccc2n1Cc1cccc(c1)-c1ccc(NS(C)(=O)=O)cc1)C(O)=O
: