Target
Arachidonate 5-lipoxygenase-activating protein
Ligand
BDBM165177
Substrate
Meas. Tech.
FLAP Binding Assay
Ki
13±n/a nM
Citation
 Chai, WDeckhut, CDvorak, CAEccles, WEdwards, JPGoldberg, SDKrawczuk, PJLebsack, ADLiu, JTanis, VMTarantino, KT 1,2,5-Substituted benzimidazoles as flap modulators US Patent  US9682971 Publication Date 6/20/2017 
Target
Name:
Arachidonate 5-lipoxygenase-activating protein
Synonyms:
5-lipoxygenase activating protein 5-lipoxygenase/FLAP ALOX5AP MK-886-binding protein
Type:
Enzyme
Mol. Mass.:
18159.90
Organism:
Homo sapiens (Human)
Description:
P20292
Residue:
161
  
Inhibitor
Name:
BDBM165177
Synonyms:
US9067917, 212 | US9682971, 212
Type:
Small organic molecule
Emp. Form.:
C29H26BrN3O3S
Mol. Mass.:
576.504
SMILES:
OC(=O)[C@@H]1CCCCC1c1nc2cc(OCc3nc4ccccc4s3)ccc2n1Cc1ccc(Br)cc1
: