Target
Glycogen [starch] synthase, muscle
Ligand
BDBM212161
Substrate
Meas. Tech.
Glycogen Synthase Activity Assay
pH
7.3±n/a
Temperature
303.15±n/a K
EC50
820±n/a nM
Comments
extracted
Citation
 Nakagawa, TMatsumoto, KTakeshita, SYoshida, TTokumasu, MInoue, HKobayashi, K Pharmaceutical composition for treating diabetes US Patent  US9290487 Publication Date 3/22/2016 
Target
Name:
Glycogen [starch] synthase, muscle
Synonyms:
GYS GYS1_HUMAN Glycogen synthase (GYS1) | Muscle glycogen synthase
Type:
Enzyme
Mol. Mass.:
83779.52
Organism:
Homo sapiens (Human)
Description:
P13807
Residue:
737
  
Inhibitor
Name:
BDBM212161
Synonyms:
US9290487, compound of Ex. 8
Type:
Small organic molecule
Emp. Form.:
C28H25NO5
Mol. Mass.:
455.5018
SMILES:
Cc1cc2cccc(-c3ccc(OCc4cccc(c4)C(=O)N4CCC[C@H]4C(O)=O)cc3)c2o1
: