Target
Histone deacetylase 6
Ligand
BDBM50207561
Substrate
Meas. Tech.
HDAC Enzyme Assay
pH
8±n/a
IC50
5000±0.0 nM
Comments
extracted
Citation
 Shakespear, MRHohenhaus, DMKelly, GMKamal, NAGupta, PLabzin, LISchroder, KGarceau, VBarbero, SIyer, AHume, DAReid, RCIrvine, KMFairlie, DPSweet, MJ Histone deacetylase 7 promotes Toll-like receptor 4-dependent proinflammatory gene expression in macrophages. J Biol Chem 288:25362-74 (2013)  
Target
Name:
Histone deacetylase 6
Synonyms:
Cereblon/Histone deacetylase 6 HDAC6 Histone deacetylase 6 (HDAC6) KIAA0901 | ORF Names:JM21
Type:
Chromatin regulator; hydrolase; repressor
Mol. Mass.:
131381.51
Organism:
Homo sapiens (Human)
Description:
Q9UBN7
Residue:
1215
  
Inhibitor
Name:
BDBM50207561
Synonyms:
CHEMBL396097 N-hydroxy-2,2-diphenylacetamide
Type:
Small organic molecule
Emp. Form.:
C14H13NO2
Mol. Mass.:
227.2585
SMILES:
ONC(=O)C(c1ccccc1)c1ccccc1
: