Target
Renin
Ligand
BDBM212508
Substrate
Meas. Tech.
Inhibitory Assay
IC50
2.4±n/a nM
Citation
 Iijima, TSugama, HKawaguchi, TShen, JXia, GXie, JHirai, M Nitrogen-containing saturated heterocyclic compound US Patent  US9278944 Publication Date 3/8/2016 
Target
Name:
Renin
Synonyms:
Angiotensinogenase RENI_HUMAN
Type:
Enzyme
Mol. Mass.:
45058.99
Organism:
Homo sapiens (Human)
Description:
Residue:
406
  
Inhibitor
Name:
BDBM212508
Synonyms:
US10155731, Example 66 | US9278944, 66
Type:
Small organic molecule
Emp. Form.:
C24H31N3O5
Mol. Mass.:
441.52
SMILES:
COC(=O)NCCOc1cc(cc2ccccc12)C(C)N(C1CC1)C(=O)[C@H]1CNCCO1
: