Target
Renin
Ligand
BDBM212579
Substrate
Meas. Tech.
Inhibitory Assay
IC50
0.4±n/a nM
Citation
 Iijima, TSugama, HKawaguchi, TShen, JXia, GXie, JHirai, M Nitrogen-containing saturated heterocyclic compound US Patent  US9278944 Publication Date 3/8/2016 
Target
Name:
Renin
Synonyms:
Angiotensinogenase RENI_HUMAN
Type:
Enzyme
Mol. Mass.:
45058.99
Organism:
Homo sapiens (Human)
Description:
Residue:
406
  
Inhibitor
Name:
BDBM212579
Synonyms:
US10155731, Example 270 | US9278944, 270
Type:
Small organic molecule
Emp. Form.:
C22H32N6O4
Mol. Mass.:
444.5273
SMILES:
COC(=O)NCCCn1nc([C@@H](C)N(C2CC2)C(=O)[C@H]2CNCCO2)c2ccc(C)nc12
: