Target
Leukotriene A-4 hydrolase
Ligand
BDBM289911
Substrate
Meas. Tech.
Enzymatic Assay
pH
7.5±n/a
Temperature
298.15±n/a K
IC50
0.730±n/a nM
Comments
extracted
Citation
 Abeywardane, ABroadwater, JBrunette, SRKirrane, Jr., TMRazavi, HSibley, RSmith Keenan, LLZhang, Q Inhibitors of leukotriene production US Patent  US9573957 Publication Date 2/21/2017 
Target
Name:
Leukotriene A-4 hydrolase
Synonyms:
LKHA4_HUMAN LTA4 Leukotriene A(4) hydrolase Leukotriene A4 hydrolase
Type:
Hydrolase; metalloprotease
Mol. Mass.:
69280.41
Organism:
Homo sapiens (Human)
Description:
Human recombinant LTA4H.
Residue:
611
  
Inhibitor
Name:
BDBM289911
Synonyms:
2,2-Dimethyl-3-oxo-3-(8-{6-[5-(2H- pyrazol-3-yl)-pyridin-2-yloxy]-quinolin- 2-ylmethyl}-3,8-diaza-bicyclo[3.2.1]oct- 3-yl)-propionitrile | US9573957, Example 51
Type:
Small organic molecule
Emp. Form.:
C29H29N7O2
Mol. Mass.:
507.5863
SMILES:
CC(C)(C#N)C(=O)N1CC2CCC(C1)N2Cc1ccc2cc(Oc3ccc(cn3)-c3ccn[nH]3)ccc2n1
: