Target
Bifunctional epoxide hydrolase 2
Ligand
BDBM60949
Substrate
Meas. Tech.
t-DPPO
IC50
157.4±n/a nM
Citation
 Hammock, BDRose, TMorisseau, CLee, KS Acyl piperidine inhibitors of soluble epoxide hydrolase US Patent  US9296693 Publication Date 3/29/2016 
Target
Name:
Bifunctional epoxide hydrolase 2
Synonyms:
Eph2 Epoxide hydratase Soluble epoxide hydrolase (sEH)
Type:
Enzyme
Mol. Mass.:
62512.06
Organism:
Mus musculus (Mouse)
Description:
P34914
Residue:
554
  
Inhibitor
Name:
BDBM60949
Synonyms:
US9296693, 74
Type:
Emp. Form.:
C18H27N3O3S
Mol. Mass.:
365.49
SMILES:
CC(C)c1ccc(NC(=O)NC2CCN(CC2)S(=O)(=O)C2CC2)cc1
: