Target
Bifunctional epoxide hydrolase 2
Ligand
BDBM50327839
Substrate
Meas. Tech.
Fluorescent Based Assay
pH
7±n/a
IC50
3800±n/a nM
Comments
extracted
Citation
 Hammock, BDRose, TMorisseau, CLee, KS Acyl piperidine inhibitors of soluble epoxide hydrolase US Patent  US9296693 Publication Date 3/29/2016 
Target
Name:
Bifunctional epoxide hydrolase 2
Synonyms:
Cytosolic epoxide hydrolase 2 EPHX2 HYES_HUMAN Soluble epoxide hydrolase (sEH) | epoxide hydrolase 2, cytoplasmic
Type:
Enzyme
Mol. Mass.:
62613.07
Organism:
Homo sapiens (Human)
Description:
P34913
Residue:
555
  
Inhibitor
Name:
BDBM50327839
Synonyms:
1-(1-Propionylpiperidin-4-yl)-3-(pyridin-3-yl)urea US9296693, 9
Type:
Small organic molecule
Emp. Form.:
C14H20N4O2
Mol. Mass.:
276.3342
SMILES:
CCC(=O)N1CCC(CC1)NC(=O)Nc1cccnc1
: