Target
Bifunctional epoxide hydrolase 2
Ligand
BDBM50327857
Substrate
Meas. Tech.
Fluorescent Based Assay
pH
7±n/a
IC50
2.8±n/a nM
Comments
extracted
Citation
 Hammock, BDRose, TMorisseau, CLee, KS Acyl piperidine inhibitors of soluble epoxide hydrolase US Patent  US9296693 Publication Date 3/29/2016 
Target
Name:
Bifunctional epoxide hydrolase 2
Synonyms:
Cytosolic epoxide hydrolase 2 EPHX2 HYES_HUMAN Soluble epoxide hydrolase (sEH) | epoxide hydrolase 2, cytoplasmic
Type:
Enzyme
Mol. Mass.:
62613.07
Organism:
Homo sapiens (Human)
Description:
P34913
Residue:
555
  
Inhibitor
Name:
BDBM50327857
Synonyms:
1-(4-Isopropylphenyl)-3-(1-propionylpiperidin-4-yl)urea US9296693, 14
Type:
Small organic molecule
Emp. Form.:
C18H27N3O2
Mol. Mass.:
317.4259
SMILES:
CCC(=O)N1CCC(CC1)NC(=O)Nc1ccc(cc1)C(C)C
: