Target
Beta-secretase 1
Ligand
BDBM215020
Substrate
Meas. Tech.
In Vitro Enzymatic BACE FRET Assay
pH
4.2±n/a
IC50
<2±n/a nM
Comments
extracted
Citation
 Minatti, AELow, JDAllen, JRChen, JChen, NCheng, YJudd, TLiu, QLopez, PQian, WRumfelt, SRzasa, RMTamayo, NAXue, QYang, BZhong, W Perfluorinated 5,6-dihydro-4H-1,3-oxazin-2-amine compounds as beta-secretase inhibitors and methods of use US Patent  US9296734 Publication Date 3/29/2016 
Target
Name:
Beta-secretase 1
Synonyms:
ASP2 Aspartyl protease 2 BACE1 Beta-secretase (BACE) Beta-secretase 1 (BACE 1) Beta-secretase 1 (BACE1) Beta-site amyloid precursor protein cleaving enzyme 1 Memapsin-2 beta-Secretase (BACE-1) | beta-Secretase (BACE1)
Type:
Protein
Mol. Mass.:
55755.10
Organism:
Homo sapiens (Human)
Description:
P56817
Residue:
501
  
Inhibitor
Name:
BDBM215020
Synonyms:
US9296734, 212
Type:
Small organic molecule
Emp. Form.:
C20H16ClF4N5O3
Mol. Mass.:
485.819
SMILES:
C[C@]1(C[C@H](OC(N)=N1)C(F)(F)F)c1cc(NC(=O)c2cnc(OCC#C)cn2)cc(Cl)c1F
: