Target
Beta-secretase 1
Ligand
BDBM214982
Substrate
Meas. Tech.
In Vitro BACE Cell-Based Assay
Temperature
310.15±n/a K
IC50
6.6±n/a nM
Comments
extracted
Citation
 Minatti, AELow, JDAllen, JRChen, JChen, NCheng, YJudd, TLiu, QLopez, PQian, WRumfelt, SRzasa, RMTamayo, NAXue, QYang, BZhong, W Perfluorinated 5,6-dihydro-4H-1,3-oxazin-2-amine compounds as beta-secretase inhibitors and methods of use US Patent  US9296734 Publication Date 3/29/2016 
Target
Name:
Beta-secretase 1
Synonyms:
ASP2 Aspartyl protease 2 BACE1 Beta-secretase (BACE) Beta-secretase 1 (BACE 1) Beta-secretase 1 (BACE1) Beta-site amyloid precursor protein cleaving enzyme 1 Memapsin-2 beta-Secretase (BACE-1) | beta-Secretase (BACE1)
Type:
Protein
Mol. Mass.:
55755.10
Organism:
Homo sapiens (Human)
Description:
P56817
Residue:
501
  
Inhibitor
Name:
BDBM214982
Synonyms:
US9296734, 175
Type:
Small organic molecule
Emp. Form.:
C18H14BrF5N4O2
Mol. Mass.:
493.225
SMILES:
C[C@]1(C[C@H](OC(N)=N1)C(F)(F)F)c1cc(NC(=O)c2ccc(Br)cn2)cc(F)c1F
: