Target
Cellular tumor antigen p53 [1-83]/E3 ubiquitin-protein ligase Mdm2 [1-188]
Ligand
BDBM215359
Substrate
Meas. Tech.
Homogenous Time-Resolved Fluorescence Assay (HTRF2 Assay)
pH
7.4±n/a
Temperature
298.15±n/a K
IC50
0.4±n/a nM
Comments
extracted
Citation
Target
Name:
Cellular tumor antigen p53 [1-83]/E3 ubiquitin-protein ligase Mdm2 [1-188]
Synonyms:
MDM2 and p53 | mdm2
Type:
Enzyme
Mol. Mass.:
Description:
Components:
This complex has 2 components.
Component 1
Name:
E3 ubiquitin-protein ligase Mdm2 [1-188]
Synonyms:
E3 ubiquitin-protein ligase Mdm2 (aa 1-188) MDM2_HUMAN
Type:
Mol. Mass.:
21319.18
Organism:
Homo sapiens (Human)
Description:
Q00987[1-188]
Residue:
188
  
Component 2
Name:
Cellular tumor antigen p53 [1-83]
Synonyms:
P53 TP53 | Tumor suppressor p53
Type:
Enzyme
Mol. Mass.:
8975.74
Organism:
Homo sapiens (Human)
Description:
Residues 1-83
Residue:
83
  
Inhibitor
Name:
BDBM215359
Synonyms:
US9296736, 327 | US9593129, Example 327
Type:
Small organic molecule
Emp. Form.:
C32H32Cl2FNO5S
Mol. Mass.:
632.57
SMILES:
CC[C@]1(CC(O)=O)C[C@@H]([C@H](N([C@H](CS(=O)(=O)c2ccccc2F)C2CC2)C1=O)c1ccc(Cl)cc1)c1cccc(Cl)c1
: