Target
Nischarin
Ligand
BDBM215804
Substrate
Meas. Tech.
I1 Receptor Binding Assay
pH
7.35±n/a
Temperature
310.15±n/a K
Ki
120±n/a nM
Comments
extracted
Citation
 Bousquet, PEhrhardt, JDFellmann, LGasparik, VGreney, HHadjeri, MMann, ANiederhoffer, NSchann, S Amino-pyrroline derivatives, and use thereof in the prevention and/or treatment of metabolic syndrome US Patent  US9303019 Publication Date 4/5/2016 
Target
Name:
Nischarin
Synonyms:
IRAS Imidazoline receptor 1 (I1R) NISCH Nischarin
Type:
Enzyme
Mol. Mass.:
166571.31
Organism:
Homo sapiens (Human)
Description:
Q9Y2I1
Residue:
1504
  
Inhibitor
Name:
BDBM215804
Synonyms:
US9303019, 13
Type:
Small organic molecule
Emp. Form.:
C11H13ClN2
Mol. Mass.:
208.687
SMILES:
CC1CCC(Nc2ccccc2Cl)=N1
: