Target
Nicotinamide phosphoribosyltransferase
Ligand
BDBM217083
Substrate
Meas. Tech.
Time-Resolved Fluorescence Resonance Energy Transfer (TR-FRET) Binding Assay
pH
7.5±n/a
IC50
377±n/a nM
Comments
extracted
Citation
 Curtin, MLSorensen, BKHeyman, HRClark, RFWoller, KRShah, OJMichaelides, MTse, CVasudevan, AMack, HHansen, TMSweis, RPliushchev, MA NAMPT and rock inhibitors US Patent  US9302989 Publication Date 4/5/2016 
Target
Name:
Nicotinamide phosphoribosyltransferase
Synonyms:
NAMPT NAmPRTase Nicotinamide phosphoribosyltransferase (NAMPT) PBEF1 | Pre-B-cell colony-enhancing factor 1
Type:
Enzyme
Mol. Mass.:
55524.98
Organism:
Homo sapiens (Human)
Description:
P43490
Residue:
491
  
Inhibitor
Name:
BDBM217083
Synonyms:
US9302989, 378
Type:
Small organic molecule
Emp. Form.:
C23H17FN4O2
Mol. Mass.:
400.4051
SMILES:
Fc1cccc2c1c(n[nH]c2=O)-c1ccc(NC(=O)N2Cc3ccccc3C2)cc1
: