Target
Nicotinamide phosphoribosyltransferase
Ligand
BDBM216621
Substrate
Meas. Tech.
Time-Resolved Fluorescence Resonance Energy Transfer (TR-FRET) Binding Assay
pH
7.5±n/a
IC50
1.51±n/a nM
Comments
extracted
Citation
 Curtin, MLSorensen, BKHeyman, HRClark, RFWoller, KRShah, OJMichaelides, MTse, CVasudevan, AMack, HHansen, TMSweis, RPliushchev, MA NAMPT and rock inhibitors US Patent  US9302989 Publication Date 4/5/2016 
Target
Name:
Nicotinamide phosphoribosyltransferase
Synonyms:
NAMPT NAmPRTase Nicotinamide phosphoribosyltransferase (NAMPT) PBEF1 | Pre-B-cell colony-enhancing factor 1
Type:
Enzyme
Mol. Mass.:
55524.98
Organism:
Homo sapiens (Human)
Description:
P43490
Residue:
491
  
Inhibitor
Name:
BDBM216621
Synonyms:
US9302989, 1283
Type:
Small organic molecule
Emp. Form.:
C25H26N4O3
Mol. Mass.:
430.4989
SMILES:
CC(C)(O)C(=O)N1CCC(=CC1)c1ccc(NC(=O)N2Cc3ccc(cc3C2)C#N)cc1
: