Target
Rho-associated protein kinase 2
Ligand
BDBM217101
Substrate
Meas. Tech.
ROCK2 Kinase Activity Assays
Ki
182±n/a nM
Citation
 Curtin, MLSorensen, BKHeyman, HRClark, RFWoller, KRShah, OJMichaelides, MTse, CVasudevan, AMack, HHansen, TMSweis, RPliushchev, MA NAMPT and rock inhibitors US Patent  US9302989 Publication Date 4/5/2016 
Target
Name:
Rho-associated protein kinase 2
Synonyms:
KIAA0619 ROCK2 Rho kinase 2 (ROCKII) Rho-associated protein kinase 2 (ROCK2) Rho-associated protein kinase 2/Transforming protein RhoA Rho-associated, coiled-coil-containing protein kinase II p164 ROCK-2
Type:
Protein
Mol. Mass.:
160885.43
Organism:
Homo sapiens (Human)
Description:
O75116
Residue:
1388
  
Inhibitor
Name:
BDBM217101
Synonyms:
US9302989, 396
Type:
Small organic molecule
Emp. Form.:
C28H26FN5O2
Mol. Mass.:
483.5367
SMILES:
F[C@@H]1CCN(Cc2ccc3CN(Cc3c2)C(=O)Nc2ccc(cc2)-c2n[nH]c(=O)c3ccccc23)C1
: