Target
Histone deacetylase 1
Ligand
BDBM218235
Substrate
Meas. Tech.
HDAC Activity Assay
pH
8±n/a
IC50
5730±n/a nM
Comments
extracted
Citation
 Kozikowski, AKalin, JHButler, KVBergman, JHancock, WW HDAC inhibitors and therapeutic methods using the same US Patent  US9249087 Publication Date 2/2/2016 
Target
Name:
Histone deacetylase 1
Synonyms:
Cereblon/Histone deacetylase 1 HDAC1 Histone deacetylase 1 (HDAC1) RPD3L1
Type:
Enzyme
Mol. Mass.:
55090.27
Organism:
Homo sapiens (Human)
Description:
Q13547
Residue:
482
  
Inhibitor
Name:
BDBM218235
Synonyms:
US9249087, Table 1 , Compound 12
Type:
Small organic molecule
Emp. Form.:
C12H10NO2
Mol. Mass.:
200.2133
SMILES:
ONC(=O)c1ccc(cc1)-c1cccc1
: