Target
Histone deacetylase 6
Ligand
BDBM218179
Substrate
Meas. Tech.
HDAC Activity Assay
pH
8±n/a
IC50
>30000±n/a nM
Comments
extracted
Citation
 Kozikowski, AKalin, JHButler, KVBergman, JHancock, WW HDAC inhibitors and therapeutic methods using the same US Patent  US9249087 Publication Date 2/2/2016 
Target
Name:
Histone deacetylase 6
Synonyms:
Cereblon/Histone deacetylase 6 HDAC6 Histone deacetylase 6 (HDAC6) KIAA0901 | ORF Names:JM21
Type:
Chromatin regulator; hydrolase; repressor
Mol. Mass.:
131381.51
Organism:
Homo sapiens (Human)
Description:
Q9UBN7
Residue:
1215
  
Inhibitor
Name:
BDBM218179
Synonyms:
US9249087, 22
Type:
Small organic molecule
Emp. Form.:
C16H14N2O
Mol. Mass.:
250.2952
SMILES:
NC(=O)c1ccc(Cn2ccc3ccccc23)cc1
: