Target
Potassium channel subfamily K member 3
Ligand
BDBM218606
Substrate
Meas. Tech.
TASK-1 Inhibiition Assay
Temperature
298.15±n/a K
IC50
74±n/a nM
Comments
extracted
Citation
 Bialy, LLorenz, KWirth, KSteinmeyer, KHessler, G Fused pyrroledicarboxamides and their use as pharmaceuticals US Patent  US9284333 Publication Date 3/15/2016 
Target
Name:
Potassium channel subfamily K member 3
Synonyms:
Acid-sensitive potassium channel TASK-1 KCNK3 Potassium channel protein TASK-1 Potassium channel subfamily K member 3 (TASK-1) TASK1 Two pore K(+) channel KT3.1 | Two pore potassium channel KT3.1
Type:
Protein
Mol. Mass.:
43534.71
Organism:
Homo sapiens (Human)
Description:
O14649
Residue:
394
  
Inhibitor
Name:
BDBM218606
Synonyms:
US9284333, 16cx | US9884860, Example 16cx
Type:
Small organic molecule
Emp. Form.:
C22H27N3O3
Mol. Mass.:
381.4681
SMILES:
CC[C@@H](NC(=O)c1cc(C(=O)N2CCCC2)n2CCOCc12)c1ccccc1
: