Target
Potassium channel subfamily K member 3
Ligand
BDBM218568
Substrate
Meas. Tech.
TASK-1 Inhibiition Assay
Temperature
298.15±n/a K
IC50
80±n/a nM
Comments
extracted
Citation
 Bialy, LLorenz, KWirth, KSteinmeyer, KHessler, G Fused pyrroledicarboxamides and their use as pharmaceuticals US Patent  US9284333 Publication Date 3/15/2016 
Target
Name:
Potassium channel subfamily K member 3
Synonyms:
Acid-sensitive potassium channel TASK-1 KCNK3 Potassium channel protein TASK-1 Potassium channel subfamily K member 3 (TASK-1) TASK1 Two pore K(+) channel KT3.1 | Two pore potassium channel KT3.1
Type:
Protein
Mol. Mass.:
43534.71
Organism:
Homo sapiens (Human)
Description:
O14649
Residue:
394
  
Inhibitor
Name:
BDBM218568
Synonyms:
US9284333, 16md | US9884860, Example 16md
Type:
Small organic molecule
Emp. Form.:
C23H26N4O2S
Mol. Mass.:
422.543
SMILES:
CC[C@@H](NC(=O)c1cc(C(=O)NCc2nccs2)c2CCCCn12)c1ccccc1
: