Target
Metabotropic glutamate receptor 2
Ligand
BDBM160566
Substrate
Meas. Tech.
MGluR2 cAMP Assay
pH
7±n/a
EC50
182±n/a nM
Comments
extracted
Citation
 Mattson, RJMeng, ZGuernon, LR Positive allosteric modulators of mGluR2 US Patent  US9682980 Publication Date 6/20/2017 
Target
Name:
Metabotropic glutamate receptor 2
Synonyms:
GPRC1B GRM2_HUMAN Metabotropic glutamate receptor mGlu2 | metabotropic glutamate 2
Type:
Enzyme
Mol. Mass.:
95584.88
Organism:
Homo sapiens (Human)
Description:
Q14416
Residue:
872
  
Inhibitor
Name:
BDBM160566
Synonyms:
US9682980, 3-(Cyclopropylmethyl)-8-methyl-7-(4-phenylpiperidin-1-yl)-[1,2,4]triazolo[4,3-b]pyridazine
Type:
Small organic molecule
Emp. Form.:
C21H25N5
Mol. Mass.:
347.4567
SMILES:
Cc1c(cnn2c(CC3CC3)nnc12)N1CCC(CC1)c1ccccc1
: