Target
Metabotropic glutamate receptor 2
Ligand
BDBM160615
Substrate
Meas. Tech.
MGluR2 cAMP Assay
pH
7±n/a
EC50
158±n/a nM
Comments
extracted
Citation
 Mattson, RJMeng, ZGuernon, LR Positive allosteric modulators of mGluR2 US Patent  US9682980 Publication Date 6/20/2017 
Target
Name:
Metabotropic glutamate receptor 2
Synonyms:
GPRC1B GRM2_HUMAN Metabotropic glutamate receptor mGlu2 | metabotropic glutamate 2
Type:
Enzyme
Mol. Mass.:
95584.88
Organism:
Homo sapiens (Human)
Description:
Q14416
Residue:
872
  
Inhibitor
Name:
BDBM160615
Synonyms:
US9682980, 8-Chloro-3-(cyclopropylmethyl)-N-(((1R,2R)-2-(4-fluorophenyl)cyclopropyl)methyl)-[1,2,4]triazolo[4,3-b]pyridazin-7-amine
Type:
Small organic molecule
Emp. Form.:
C20H22FN5
Mol. Mass.:
351.4206
SMILES:
Cc1c(NC[C@@H]2C[C@@H]2c2ccc(F)cc2)cnn2c(CC3CC3)nnc12
: