Target
Metabotropic glutamate receptor 2
Ligand
BDBM160725
Substrate
Meas. Tech.
MGluR2 cAMP Assay
pH
7±n/a
EC50
145±n/a nM
Comments
extracted
Citation
 Mattson, RJMeng, ZGuernon, LR Positive allosteric modulators of mGluR2 US Patent  US9682980 Publication Date 6/20/2017 
Target
Name:
Metabotropic glutamate receptor 2
Synonyms:
GPRC1B GRM2_HUMAN Metabotropic glutamate receptor mGlu2 | metabotropic glutamate 2
Type:
Enzyme
Mol. Mass.:
95584.88
Organism:
Homo sapiens (Human)
Description:
Q14416
Residue:
872
  
Inhibitor
Name:
BDBM160725
Synonyms:
US9682980, 8-Chloro-7-(4-(4-fluorophenyl)piperidin-1-yl)-3-neopentyl-[1,2,4]triazolo[4,3-b]pyridazine
Type:
Small organic molecule
Emp. Form.:
C21H25ClFN5
Mol. Mass.:
401.908
SMILES:
CC(C)(C)Cc1nnc2c(Cl)c(cnn12)N1CCC(CC1)c1ccc(F)cc1
: