Target
Metabotropic glutamate receptor 2
Ligand
BDBM160749
Substrate
Meas. Tech.
MGluR2 cAMP Assay
pH
7±n/a
EC50
15±n/a nM
Comments
extracted
Citation
 Mattson, RJMeng, ZGuernon, LR Positive allosteric modulators of mGluR2 US Patent  US9682980 Publication Date 6/20/2017 
Target
Name:
Metabotropic glutamate receptor 2
Synonyms:
GPRC1B GRM2_HUMAN Metabotropic glutamate receptor mGlu2 | metabotropic glutamate 2
Type:
Enzyme
Mol. Mass.:
95584.88
Organism:
Homo sapiens (Human)
Description:
Q14416
Residue:
872
  
Inhibitor
Name:
BDBM160749
Synonyms:
US9682980, Methyl-2-(1-(8-chloro-3-(2,2,2-trifluoroethyl)-[1,2,4]triazolo[4,3-b]pyridazin-7-yl)piperidin-4-yl)benzoate
Type:
Small organic molecule
Emp. Form.:
C19H17ClF3N5O2
Mol. Mass.:
439.819
SMILES:
OC(=O)c1ccccc1C1CCN(CC1)c1cnn2c(CC(F)(F)F)nnc2c1Cl
: