Target
Metabotropic glutamate receptor 2
Ligand
BDBM160771
Substrate
Meas. Tech.
MGluR2 cAMP Assay
pH
7±n/a
EC50
425±n/a nM
Comments
extracted
Citation
 Mattson, RJMeng, ZGuernon, LR Positive allosteric modulators of mGluR2 US Patent  US9682980 Publication Date 6/20/2017 
Target
Name:
Metabotropic glutamate receptor 2
Synonyms:
GPRC1B GRM2_HUMAN Metabotropic glutamate receptor mGlu2 | metabotropic glutamate 2
Type:
Enzyme
Mol. Mass.:
95584.88
Organism:
Homo sapiens (Human)
Description:
Q14416
Residue:
872
  
Inhibitor
Name:
BDBM160771
Synonyms:
US9682980, 8-Chloro-3-(cyclopropylmethyl)-N-ethyl-N-((2-(4-fluorophenyl)cyclopropyl)methyl)-[1,2,4]triazolo[4,3-b]pyridazin-7-amine
Type:
Small organic molecule
Emp. Form.:
C21H23ClFN5
Mol. Mass.:
399.892
SMILES:
CCN(CC1CC1c1ccc(F)cc1)c1cnn2c(CC3CC3)nnc2c1Cl
: