Target
Arginase-2, mitochondrial
Ligand
BDBM290415
Substrate
Meas. Tech.
Inhibition Assay of Arginase
pH
7.4±n/a
Temperature
298.15±n/a K
IC50
<250±n/a nM
Comments
extracted
Citation
 Van Zandt, MJagdmann, GE Arginase inhibitors as therapeutics US Patent  US10098902 Publication Date 10/16/2018 
Target
Name:
Arginase-2, mitochondrial
Synonyms:
ARG2 Arginase II Non-hepatic arginase | Type II arginase
Type:
PROTEIN
Mol. Mass.:
38576.93
Organism:
Homo sapiens (Human)
Description:
ChEMBL_978892
Residue:
354
  
Inhibitor
Name:
BDBM290415
Synonyms:
(3R,4S)-3-amino-4-(3-boronopropyl)-1-((6-chloro-1,2,3,4- tetrahydroisoquinolin-3-yl)methyl)pyrrolidine-3-carboxylic acid US10603330, Example 51 | US11389464, Example 51
Type:
Small organic molecule
Emp. Form.:
C18H27BClN3O4
Mol. Mass.:
395.689
SMILES:
N[C@]1(CN(CC2Cc3cc(Cl)ccc3CN2)C[C@@H]1CCCB(O)O)C(O)=O
: