Target
Amiloride-sensitive amine oxidase [copper-containing]
Ligand
BDBM220866
Substrate
US9302986, benzylamine
Meas. Tech.
DAO Inhibition Assay
pH
7.4±n/a
Temperature
310.15±n/a K
IC50
>10000±n/a nM
Comments
extracted
Citation
 Deodhar, MFindlay, ADFoot, JSJarolimek, WMcdonald, IARobertson, ADTurner, CI Substituted 3-haloallylamine inhibitors of ASSAO and uses thereof US Patent  US9302986 Publication Date 4/5/2016 
Target
Name:
Amiloride-sensitive amine oxidase [copper-containing]
Synonyms:
ABP AOC1 Amiloride-binding protein DAO1 Diamine oxidase (DAO) KAO | Kidney amine oxidase
Type:
Protein
Mol. Mass.:
85387.64
Organism:
Homo sapiens (Human)
Description:
P19801
Residue:
751
  
Inhibitor
Name:
BDBM220866
Synonyms:
US11472769, Compound BI-1467335-(PXS-4728A) | US9302986, 23
Type:
Small organic molecule
Emp. Form.:
C15H21FN2O2
Mol. Mass.:
280.3378
SMILES:
CC(C)(C)NC(=O)c1ccc(OC\C(CN)=C\F)cc1
:
Substrate
Name:
BDBM10999
Synonyms:
Benzenemethanamine CHEMBL522 phenylmethanamine
Type:
Small organic molecule
Emp. Form.:
C7H9N
Mol. Mass.:
107.1531
SMILES:
NCc1ccccc1
: